{"text_format":"1","workbook":"xlsx","n_sheets":4,"sheets":["PRJ","ESD","Digital Signage","IFC"],"not_rendered":{"charts":0,"images":0,"macros":1,"external_links":0,"defined_names":2,"comments":0,"pivot_tables":0},"unopened":[],"bounds":{"document_bytes":16777216,"sheet_cells":100000,"rows_first":2000,"rows_last":500,"rows_between":2000,"halvings":0,"cell_chars":16384,"cell_head_chars":4096},"cells_cut":0,"cells_raw":0,"read":"whole","date_system":"1900"}

{"sheet":"PRJ","index":0,"n_rows":112,"n_cols":9,"rows_kept":112,"cut":false,"hidden":false,"merged":[]}
["BenQ America Corp.",null,null,null,"                                                                 "]
["Effective: ","2024-10-01"]
["SHORT DESCRIPTION CONTENT: Size, Color, Resolution, Display, Brightness, Contrast Ratio, Input Connectors"]
["LONG DESCRIPTION CONTENT: Size, Color, Resolution, Display, Brightness, Contrast Ratio, Input Connectors, Key Feature"]
["MODEL","WARRANTY","PRODUCT NUMBER","MSRP","STATUS","SERIES","COLOR","SHORT PRODUCT DESCRIPTION ","COO"]
["EH700","3 Year","9H.JSM77.14A",1949,null,"1080p Laser","WHITE","1080p Laser,WHITE,1080P (1920x1080),DLP,4000,3,000,000:1","CN"]
["GS50","3 Year","9H.JPC77.59A ",999,"Promo (10/1-10/31)@699; PBDD (10/8-10/9)@599/(11/1-11/14)@699; (11/15-11/30)@599/(12/1-12/15)@599; (12/16-12/31)@699","1080p","WHITE","1080P,WHITE,1920x1080,DLP,500,100000:1","CN"]
["GV10","3 Year","9H.JPW77.19A",349,0,"PV(VIDEO PJ)-S4(480P)","GREEN","PV(VIDEO PJ)-S4(480P),GREEN,WVGA (854x480),DLP,200,3,000:1","CN"]
["HT2060","3 Year","9H.JRJ77.17A",1199,"Promo (10/1-10/31)@899; PBDD (10/8-10/9))@849/(11/1-11/30)@899; (11/29-12/2)@799/(12/1-12/31)@899","1080p","WHITE","1080p,WHITE,1920x1080,DLP,2300,500,000:1","CN"]
["HT2150ST","3 Year","9H.JFP77.13A",1299,"EOL","1080p/ST","WHITE","1080p/ST,WHITE,1920x1080,DLP,2200,15000:1","CN"]
["HT3550","3 Year","9H.JKC77.37A",1999,"EOL","4K/1.2x","WHITE","4K/1.2x,WHITE,3840x2160,DLP,2200,30000:1","CN"]
["HT3560","3 Year","9H.JPY77.38A",1999,"Promo (10/1-10/31)/(11/1-11/30)/(12/1-12/31)@1099","PV(VIDEO PJ)-4K(4K2K)","WHITE","PV(VIDEO PJ)-4K(4K2K),WHITE,4K UHD (3840×2160),DLP,2200,50,000:1","CN"]
["HT4550i","3 Year","9H.JR677.17A",4499,"Promo (10/1-10/31)/(11/1-11/30)/(12/1-12/31)@2499","PV(VIDEO PJ)-4K(4K2K)","BLACK","4K/1.3x,BLACk,4K UHD (3840×2160),DLP,3200,2,000,000:1","CN"]
["HT5550","3 Year","9H.JKV77.17A",2699,"Limited ","4K/1.6x","BLACK","4K/1.6x,BLACK,3840x2160,DLP,2000,100000:1","CN"]
["LH730","3 Year","9H.JLK77.15A",1699,0,"PD(DLP PJ)-S8(1080P)","WHITE","PD(DLP PJ)-S8(1080P),WHITE,1080P (1920x1080),DLP,4000,500,000:1","CN"]
["LK935","3 Year","9H.JS277.14A",4999,0,"4K-Laser","WHITE","4K-Laser,WHITE,4K UHD (3840×2160),DLP,5500,3,000,000:1","CN"]
["LK936ST","3 Year","9H.JPG77.15A",5849,0,"4K-Laser-ST","BLACK","4K-Laser-ST,BLACK,3840x2160,DLP,5100,3000000:1","CN"]
["LU710","3 Year","9H.JLM77.15A",2299,0,"WUXGA-Laser","WHITE","WUXGA-Laser,WHITE,1920x1200,DLP,4000,3000000:1","CN"]
["LH650","3 Year","9H.JS577.13A",1499,0,"1080p","WHITE","1080P (1920x1080),WHITE,1080P (1920x1080),DLP,4000,3,000,000:1","CN"]
["LU785","3 Year","9H.JL677.26A",4299,0,"WUXGA-Laser","WHITE","WUXGA-Laser,WHITE,1920x1200,DLP,6000,3000000:1","CN"]
["LU930","3 Year","9H.JM277.15A",3199,0,"WUXGA-Laser","WHITE","WUXGA-Laser,WHITE,1920x1200,DLP,5000,3000000:1","CN"]
["LU935","3 Year","9H.JNN77.15A",4249,0,"WUXGA-Laser","WHITE","WUXGA-Laser,WHITE,1920x1200,DLP,6000,3,000,000:1","CN"]
["LU935ST","3 Year","9H.JNC77.15A",4399,0,"WUXGA-Laser-ST","BLACK","WUXGA-Laser-ST,BLACK,1920x1200,DLP,5500,100000:1","CN"]
["LU960UST","3 Year","9H.JMT77.25E",7799,0,"WUXGA-Laser-ST","BLACK","WUXGA-Laser-ST,BLACK,1920x1200,DLP,5200,3000000:1","CN"]
["LU960ST2","3 Year","9H.JRG77.25E",8999,0,"WUXGA-Laser-ST","BLACK","WUXGA-Laser-ST,BLACK,WUXGA (1920x1200),DLP,5200,3,000,000:1","CN"]
["LU9800","3 Year","9H.JPM77.25E",17999,0,"WUXGA-Laser","BLACK","WUXGA-Laser,BLACK,1920x1200,DLP,10000,3000000:1","CN"]
["LW500","3 Year","9H.JRE77.13A",899,"EOL Mar'23","WXGA","WHITE","WXGA,GREEN,1280x800,DLP,2000,20,000:1","CN"]
["LW855UST","3 Year","9H.JRY77.24A",2499,0,"WXGA UST Laser","WHITE","WXGA UST Laser,WHITE,WXGA (1280x800),DLP,3500,16000:1","CN"]
["LH856UST","3 Year","9H.JS177.24A",2799,0,"1080p UST Laser","WHITE","1080p UST Laser,WHITE,1080P (1920x1080),DLP,3500,15000:1","CN"]
["LW600ST","3 Year","9H.JS377.13A",999,0,"WXGA-LED-ST","BLACK","WXGA-LED-ST,BLACK,WXGA (1280x800),DLP,2800,20000:1","CN"]
["LH600ST","3 Year","9H.JS477.13A",1199,0,"1080p-LED-ST","BLACK","1080p-LED-ST,BLACK,1080P (1920x1080),DLP,2500,20000:1","CN"]
["AH700ST","3 Year","9H.JST77.13A",2099,0,"1080p ST Laser","BLACK","1080p ST Laser,BLACK,1080P (1920x1080),DLP,4000,3,000,000:1","CN"]
["LW550","3 Year","9H.JRT77.13A",1049,0,"WXGA","WHITE","WXGA,WHITE,1280x800,DLP,3000,20,000:1","CN"]
["MH733","3 Year","9H.JGT77.13A",999,"Promo (10/15-10/31)/(11/15-11/30)/(12/16-12/31)@799","1080p","WHITE","1080p,WHITE,1920x1080,DLP,4000,16000:1","CN"]
["MS560","3 Year","9H.JND77.1HA",409,"Promo(10/1-10/14)/(11/15-11/30)/(12/1-12/15)@339","SVGA","WHITE","SVGA,WHITE,800x600,DLP,4000,20000:1","CN"]
["MW560","3 Year","9H.JNF77.13A",579,"Promo(10/1-10/14)/(11/15-11/30)/(12/1-12/15)@479","WXGA","WHITE","WXGA,WHITE,1280x800,DLP,4000,20000:1","CN"]
["MW632ST","3 Year","9H.JE277.13A",799,"Promo(10/1-10/14)/(11/15-11/30)/(12/1-12/15)@599","WXGA ST","WHITE","WXGA ST,WHITE,1280x800,DLP,3200,13000:1","CN"]
["MW732","3 Year","9H.JGS77.13A",1099,"Limited ","WXGA","WHITE","WXGA,WHITE,1280x800,DLP,4000,20000:1","CN"]
["MW826STH","3 Year","9H.JMW77.13A",949,0,"WXGA ST","WHITE","WXGA ST,WHITE,1280x800,DLP,3500,20000:1","CN"]
["MW855UST+","3 Year","9H.JKS77.24A",1699,0,"WXGA UST 0.35","WHITE","WXGA UST 0.35,WHITE,1280x800,DLP,3500,10000:1","CN"]
["MX825STH","3 Year","9H.JMV77.13A",1399,0,"XGA ST","WHITE","XGA ST,WHITE,1024x768,DLP,3500,20000:1","CN"]
["RE6504(3 Year)","3 Year","9H.F9ETK.DA5",2549,"New Oct'24","Essential","BLACK","65\",BLACK, 3840x2160,IPS,400,1200:1,HDMI/LAN/USB-C/RJ45/RS232 input","CN"]
["RE6504(5 Year)","5 Year","9H.F9ETK.DA5",2705,"New Oct'24","Essential","BLACK","5 YEAR WARRANTY, 65\",BLACK, 3840x2160,IPS,400,1200:1,HDMI/LAN/USB-C/RJ45/RS232 input","CN"]
["RE7504(3 Year)","3 Year","9H.F9FTK.DA5",4179,"New Oct'24","Essential","BLACK","75\",BLACK, 3840x2160,IPS,400,1200:1,HDMI/LAN/USB-C/RJ45/RS232 input","CN"]
["RE7504(5 Year)","5 Year","9H.F9FTK.DA5",4413,"New Oct'24","Essential","BLACK","5 YEAR WARRANTY,75\",BLACK, 3840x2160,IPS,400,1200:1,HDMI/LAN/USB-C/RJ45/RS232 input","CN"]
["RE8601(3 Year)","3 Year","9H.F72TK.DA2",5609,0,"Essential","BLACK","86\",BLACK, 3840x2160,TV, 400,1200:1,VGA/HDMI/LAN/USB Type Bx3/RJ45/RS232 input","CN"]
["RE8601(5 Year)","5 Year","9H.F72TK.DA2",5869,0,"Essential","BLACK","5 YEAR WARRANTY, 86,BLACK, 3840x2160,TV, 400,1200:1, VGA/HDMI/LAN/USB Type Bx3/RJ45/RS232 input","CN"]
["RE8603(3 Year)","3 Year","9H.F87TC.DE1",5609,0,"Essential","BLACK","86\",BLACK, 3840x2160,IPS,350,1200:1,VGA/HDMI/LAN/USB Type Bx2/RJ45/RS232 input","CN"]
["RE8603(5 Year)","5 Year","9H.F87TC.DE1",5869,0,"Essential","BLACK","5 YEAR WARRANTY, 86\",BLACK, 3840x2160,TV,350,1200:1,VGA/HDMI/LAN/USB Type Bx2/RJ45/RS232 input","CN"]
["RE8604(3 Year)","3 Year","9H.F9GTK.DA5",5609,"New Oct'24","Essential","BLACK","86\",BLACK, 3840x2160,IPS,400,1200:1,HDMI/LAN/USB-C/RJ45/RS232 input","CN"]
["RE8604(5 Year)","5 Year","9H.F9GTK.DA5",5869,"New Oct'24","Essential","BLACK","5 YEAR WARRANTY, 86\",BLACK, 3840x2160,IPS,350,1200:1,VGA/HDMI/LAN/USB Type Bx2/RJ45/RS232 input/RS232 input","CN"]
["RE9801(3 Year)","3 Year","9H.F79TK.DP1",18699,0,"Essential","BLACK","98\",BLACK, 3840x2160,TV, 500, 1200:1,VGA/HDMI/LAN/USB Type Bx3/RJ45/RS232 input","CN"]
["RE9801(5 Year)","5 Year","9H.F79TK.DP1",19879,0,"Essential","BLACK","5 YEAR WARRANTY, 98,BLACK, 3840x2160,TV, 500, 1200:1, VGA/HDMI/LAN/USB Type Bx3/RJ45/RS232 input","CN"]
["RM6504(3 Year)","3 Year","9H.F9ATK.DA1",3199,0,"Master","BLACK","65\",BLACK, 3840x2160,TV,,1200:1,LAN/HDMI/VGA/DP/USB Type Bx3","CN"]
["RM6504(5 Year)","5 Year","9H.F9ATK.DA1",3355,0,"Master","BLACK","5 YEAR WARRANTY,65\",BLACK, 3840x2160,TV,,1200:1,LAN/HDMI/VGA/DP/USB Type Bx3","CN"]
["RM7504(3 Year)","3 Year","9H.F9CTK.DA1",5099,0,"Master","BLACK","75\",BLACK, 3840x2160,TV,,1200:1,LAN/HDMI/VGA/DP/USB Type Bx3","CN"]
["RM7504(5 Year)","5 Year","9H.F9CTK.DA1",5333,0,"Master","BLACK","5 YEAR WARRANTY,75\",BLACK, 3840x2160,TV,,1200:1,LAN/HDMI/VGA/DP/USB Type Bx3","CN"]
["RM8604(3 Year)","3 Year","9H.F9DTK.DA1",6599,0,"Master","BLACK","86\",BLACK, 3840x2160,TV,, 1200:1,LAN/HDMI/VGA/DP/USB Type Bx3","CN"]
["RM8604(5 Year)","5 Year","9H.F9DTK.DA1",6859,0,"Master","BLACK","5 YEAR WARRANTY, 86\",BLACK, 3840x2160,TV,, 1200:1,LAN/HDMI/VGA/DP/USB Type Bx3","CN"]
["RP6504(3 Year)","3 Year","9H.F97TC.DA1",3799,0,"Pro","BLACK","65\",BLACK, 3840x2160,IPS, 400, 1200:1,VGA/HDMI/LAN/USB Type Bx3/RJ45/RS232 input","CN"]
["RP6504(5 Year)","5 Year","9H.F97TC.DA1",3955,0,"Pro","BLACK","5 YEAR WARRANTY, 65\",BLACK, 3840x2160,TV, 400, 1200:1,VGA/HDMI/LAN/USB Type Bx3/RJ45/RS232 input","CN"]
["RP7503(3 Year)","3 Year","9H.F83TK.DE1",5949,0,"Pro","BLACK","75\",BLACK, 3840x2160,TV,w/Glass 400; wo/Glass 450,1200:1, VGA/HDMI IN*3, HDMI OUT*1/LAN/USB Type B*3/USB Type C*2/RJ45/RS232 input","CN"]
["RP7503(5 Year)","5 Year","9H.F83TK.DE1",6183,0,"Pro","BLACK","5 YEAR WARRANTY, 75\",BLACK, 3840x2160,TV,w/Glass 400; wo/Glass 450,1200:1, VGA/HDMI IN*3, HDMI OUT*1/LAN/USB Type B*3/USB Type C*2/RJ45/RS232 input","CN"]
["RP7504(3 Year)","3 Year","9H.F98TC.DA1",5949,0,"Pro","BLACK","75\",BLACK, 3840x2160,IPS,400,1200:1,HDMI/LAN/USB Type Bx3/RJ45/RS232 input","CN"]
["RP7504(5 Year)","5 Year","9H.F98TC.DA1",6183,0,"Pro","BLACK","5 YEAR WARRANTY,75\",BLACK, 3840x2160,IPS,400,1200:1,HDMI/LAN/USB Type Bx3/RJ45/RS232 input","CN"]
["RP8604(3 Year)","3 Year","9H.F99TC.DA1",9439,0,"Pro","BLACK","86\",BLACK, 3840x2160,IPS,400,1200:1,HDMI/LAN/USB Type Bx3/RJ45/RS232 input","CN"]
["RP8604(5 Year)","5 Year","9H.F99TC.DA1",9699,0,"Pro","BLACK","5 YEAR WARRANTY,86\",BLACK, 3840x2160,IPS,400,1200:1,HDMI/LAN/USB Type Bx3/RJ45/RS232 input","CN"]
["TH575","3 Year","9H.JRF77.13A",699,"Promo(10/1-10/14)@549/(11/15-11/30)@499/(12/1-12/15)@499; (12/16-12/31)@549","1080p","WHITE","1080p,WHITE,1920x1080,DLP,3800,15,000:1","CN"]
["TH585P","3 Year","9H.JLS77.14A",699,"EOL Jan'23","1080p","WHITE","1080p,WHITE,1920x1080,DLP,3500,10000:1","CN"]
["TH671ST","3 Year","9H.JGY77.13A",999,"Promo(10/1-10/14)@699/(11/15-11/30)@699/(12/1-12/15)@699; (12/16-12/31)@749","1080p/ST","WHITE","1080p/ST,WHITE,1920x1080,DLP,3000,10000:1","CN"]
["TH685i","3 Year","9H.JNK77.17A",1099,"Promo (10/1-10/31)/(11/1-11/30)/(12/1-12/31)@799","1080p","WHITE","1080p,WHITE,1920x1080,DLP,3500,10000:1","CN"]
["TH685P","3 Year","9H.JL877.14A",999,"Promo (10/15-10/31)/(11/15-11/30)/(12/16-12/31)@699","1080p","WHITE","1080p,WHITE,1920x1080,DLP,3500,10000:1","CN"]
["TK700","3 Year","9H.JPK77.17A",1799,"Promo (10/1-10/31)@1099/(11/1-11/14)@1099;(11/15-11/30)@999/(12/1-12/15)@999;(12/16-12/31)@1099","4K ","WHITE","4K,WHITE,3840x2160,DLP,3200,10000:1","CN"]
["TK860i","3 Year","9H.JR477.37A",2099,"Promo (10/1-10/31)/(11/1-11/30)/(12/1-12/31)@1199","PV(VIDEO PJ)-4K(4K2K)","WHITE","PV(VIDEO PJ)-4K(4K2K),WHITE,4K UHD (3840×2160),DLP,3300,50,000:1","CN"]
["TK700STi","3 Year","9H.JNL77.17A",1999,"Promo (10/1-10/31)@1399/(11/1-11/30)@1399;(11/29-12/2)@1299/(12/1-12/31)@1399","4K/ST","WHITE","4K/ST,WHITE,3840x2160,DLP,3000,4500:1","CN"]
["TK710STi","3 Year","9H.JSK77.17A",2399,0,"4K/ST","WHITE","4K/ST,WHITE,4K UHD (3840×2160),DLP,3200,600,000:1","CN"]
["TK710","3 Year","9H.JSJ77.17A",2199,0,"4K ","WHITE","4K,WHITE,4K UHD (3840×2160),DLP,3200,600,000:1","CN"]
["VS10","1 Year","9H.JRR78.N1A",1899,0,"Wireless","BLACK","Wireless,BLACK,1920x1080,,,","TW"]
["VS20","1 Year","9H.JRS78.N1A",2499,0,"Wireless","BLACK","Wireless,BLACK,1920x1080,,,","TW"]
["W5800","3 Year","9H.JSL77.G8D",5999,0,"4K","BLACK","4K,BLACK,4K UHD (3840×2160),DLP,2600,2,500,000:1","CN"]
["WDC10","1 Year","9H.JF878.N4A",1299,0,"Wireless","BLACK","Wireless,BLACK,1920x1080,,,","TW"]
["WDC10C","1 Year","9H.JLD78.N3A",1399,0,"Wireless","BLACK","Wireless,BLACK,1920x1080,,,","TW"]
["X3000i","3 Year","9H.JPD77.17A",2499,"EOL Feb'24","4K/ST","WHITE","4K/ST,WHITE,3840x2160,DLP,3000,500000:1","CN"]
["X3100i","3 Year","9H.JS977.18A",2999,"Promo (10/1-10/31)/(11/1-11/30)/(12/1-12/31)@2199","4K UHD","WHITE","4K UHD,WHITE,4K UHD (3840×2160),DLP,3100,500,000:1","CN"]
["X300G","3 Year","9H.JSA77.19A",2299,"Promo (10/1-10/31)@1299/(11/1-11/30)/(12/1-12/31)@1399","1080p/1.2x","WHITE","1080p/1.2x,WHITE 4K UHD (3840×2160),DLP,2000,600,000:1","CN"]
["X500i","3 Year","9H.JSC77.17A",2199,"Promo (10/1-10/31)/(11/1-11/30)/(12/1-12/31)@1499","4K UHD","WHITE","4K UHD,WHITE,4K UHD (3840×2160),DLP,2200,500,000:1","CN"]
[]
["For a complete listing of lamps and accessories for current and discontinued projectors, please refer to monthly BenQ america Accessories Price List."]
["© Copyright 2012 BenQ America Corp.  All rights reserved.  BenQ is not responsible for any errors.  Product specifications, Part Numbers and availability subject to change without notice."]
["Lamp life results will vary depending on environmental conditions and usage."]
[]
[]
[]
["Note.  "]
["For purchasing with  5 year warranty, please include both MODEL and PRODUCT NUMBER within Purchase Order: "]
["Model#","Product #"]
["RP6504","A1.3EPD2.002"]
["RE6504","A1.3EPD2.002"]
["RM6504","A1.3EPD2.002"]
[]
["RP7503","A1.3EPD2.003"]
["RP7504","A1.3EPD2.003"]
["RE7504","A1.3EPD2.003"]
["RM7504","A1.3EPD2.003"]
[]
["RP8604","A1.3EPD2.004"]
["RE8601","A1.3EPD2.004"]
["RE8603","A1.3EPD2.004"]
["RE8604","A1.3EPD2.004"]
["RM8604","A1.3EPD2.004"]
[]
["RE9801","A1.3EPD2.503"]

{"sheet":"ESD","index":1,"n_rows":16,"n_cols":11,"rows_kept":16,"cut":false,"hidden":false,"merged":[]}
["BenQ America Corp.",null,null,null,"                                                                 "]
["Effective: ","2024-10-01"]
["ZOWIE ","SHORT DESCRIPTION CONTENT: Category, Color, Size, Panel, Resolution"]
["MONITORS","LONG DESCRIPTION CONTENT: Category, Color, Size, Panel, Resolution, Connection, Key Feature"]
["MODEL","WARRANTY","PRODUCT NUMBER","MSRP","MAP","STATUS","SERIES","COLOR","SHORT PRODUCT DESCRIPTION ","LONG PRODUCT DESCRIPTION ","COO"]
["XL2746K","3 Year","9H.LKJLB.QBA","BB Map: 549",599,"Promo(10/1-12/31)","eSports","DARK GREY","eSports,DARK GREY,27\",TN,1920x1080,240Hz","eSports,DARK GREY,27\",TN,1920x1080,HDMI (v2.0)x2; DisplayPort (v1.2)x1; USB 2.0 portx1, Flicker-free Technology, Low Blue Ligh,Black eQualizer,Color Vibrance,DyAc+,S-Switch,Shield,Height Adjust,0.5ms (GtG) ,1000:1,,240Hz","CN"]
["XL2740","3 Year","9H.LGMLB.QBA","BB Map: 349",549,0,"eSports","DARK GREY","eSports,DARK GREY,27\",TN,1920x1080,240Hz","eSports,DARK GREY,27\",TN,1920x1080,DVI-DL; HDMI2.0; HDMI1.4; Display Port1.2; USB3.0,Black eQualizer,Color Vibrance,,S-Switch,Shield,Height Adjust,1ms (GtG) ,1000:1,12M:1,240Hz","CN"]
["XL2731K","3 Year","9H.LKCLB.QBA","BB Map: 199",279,0,"eSports","DARK GREY","eSports,DARK GREY,27\",TN,1920x1080,165Hz","eSports,DARK GREY,27\",TN,1920x1080,HDMI (v2.0)x2; DisplayPort (v1.2)x1; USB 2.0 portx1, Flicker-free Technology, Low Blue Ligh,Black eQualizer,Color Vibrance,DyAc,,,Height Adjust,,1000:1,,165Hz","CN"]
["XL2566K","3 Year","9H.LKRLB.QBA","BB Map: 549",599,"Promo(10/1-12/31)","eSports","DARK GREY","eSports,DARK GREY,24.5\",TN,1920x1080,360Hz","eSports,DARK GREY,24.5\",TN,1920x1080,HDMI (v2.0)x2; DisplayPort (v1.4)x1; USB 2.0 portx1, Flicker-free Technology, Low Blue Ligh,Black eQualizer,Color Vibrance,DyAc+,S-Switch,Shield,Height Adjust,,,,360Hz","CN"]
["XL2546K","3 Year","9H.LJNLB.QBA","BB Map: 399",429,0,"eSports","DARK GREY","eSports,DARK GREY,24.5\",TN,1920x1080,240Hz","eSports,DARK GREY,24.5\",TN,1920x1080,HDMI2.0x3; Display Port1.2; USB2.0; Flicker-free Technology, Low Blue Light; ZOWIE LED MONITOR XL2546K DARK GREY 24.5W FHD DyAc+ 240Hz 0.5ms low blue light HAS,Black eQualizer,Color Vibrance,DyAc+,S-Switch,Shield,Height Adjust,NA","CN"]
["XL2540K","3 Year","9H.LJMLB.QBA ","BB Map: 289",329,"Promo(10/1-12/31)","eSports","DARK GREY","eSports,DARK GREY,24.5\",TN,1920x1080,240Hz","eSports,DARK GREY,24.5\",TN,1920x1080,HDMI2.0x3; Display Port1.2; USB2.0; Flicker-free Technology, Low Blue Light; ZOWIE LED MONITOR XL2540K DARK GREY 24.5W FHD DyAc+ 240Hz 0.5ms low blue light HAS,Black eQualizer,Color Vibrance,,,,Height Adjust,NA","CN"]
["XL2411K","3 Year","9H.LJPLB.QBA",0,189,0,"eSports","DARK GREY","eSports,DARK GREY,24\",TN,1920x1080,144Hz","eSports,DARK GREY,24\",TN,1920x1080,HDMI1.4x2; HDMI2.0; Display Port1.2; USB2.0; Flicker-free Technology, Low Blue Light; ZOWIE LED MONITOR XL2411K DARK GREY 24W FHD 144Hz 1ms low blue light HAS,Black eQualizer,Color Vibrance,DyAc,,,Height Adjust,NA","CN"]
["XL2546X","3 Year","9H.LLRLB.QBA",0,499.99,"Promo(10/1-12/31)","eSports","DARK GREY","eSports,DARK GREY,24.5\",TN,1920x1080,240Hz","eSports,DARK GREY,24.5\",TN,1920x1080,HDMI1.4x1;HDMI2.0x1; Display Port1.2; USB2.0; USB 3.0 Downstream and upstream port; Flicker-free Technology, Low Blue Light; ZOWIE LED MONITOR XL2546K DARK GREY 24.5W FHD DyAc+ 240Hz 0.5ms low blue light HAS,Black eQualizer,Color Vibrance,DyAc,S-Switch,Shield,Height Adjust,NA","CN"]
["XL2586X","3 Year","9H.LM4LB.QBA",0,999.99,0,"eSports","DARK GREY","eSports,DARK GREY,24.1\",TN,1920x1080,540Hz","eSports,DARK GREY,24.1\",TN,1920x1080,540Hz DisplayPort (v1.4)x1; Flicker-free Technology, Low Blue Light HAS,Black eQualizer,Color Vibrance,,S-Switch,Shield,Height Adjust,NA","CN"]
["XL2566X+","3 Year","9H.LMRLB.QBA",0,649.99,0,"eSports","DARK GREY","eSports,DARK GREY,24.1\",TN,1920x1080,400Hz","eSports,DARK GREY,24.1\",TN,1920x1080,HDMI (v2.0)x3; DisplayPort (v1.4)x1; Flicker-free Technology, Low Blue Ligh,Black eQualizer,Color Vibrance,DyAc2,S-Switch,Shield,Height Adjust,","CN"]
["XL2546X+","3 Year","9H.LN1LB.QBA",0,499.99,"New Oct'24","eSports","DARK GREY","eSports,DARK GREY,24.1\",TN,1920x1080,280Hz","eSports,DARK GREY,24.1\",TN,1920x1080,HDMI2.0x3; Display Port1.2; Flicker-free Technology,Black eQualizer,Color Vibrance,,S-Switch,Shield,Height Adjust,NA","CN"]

{"sheet":"Digital Signage","index":2,"n_rows":18,"n_cols":11,"rows_kept":18,"cut":false,"hidden":false,"merged":[]}
["BenQ America Corp.",null,null,null,null,"                                                                 "]
["Effective: ","2024-10-01"]
["Smart Signage ","SHORT DESCRIPTION CONTENT: Size, Resolution, Series, Brightness, Key Features"]
[null,"LONG DESCRIPTION CONTENT: Series, Color, Resolution, Brightness, Contrast Ratio, Connectors, Key Features"]
["MODEL","WARRANTY","PRODUCT NUMBER","diff","MSRP","STATUS","SERIES","COLOR","SHORT PRODUCT DESCRIPTION ","LONG PRODUCT DESCRIPTION ","COO"]
["CS6501","3 Year","9H.F73TC.DA2",0,2499,0,"Corporate Signage","BLACK","65\" 4K Corporate Professional Presentation Display","65\", BLACK, 3840x2160, 450nits, 1200:1, HDMI/VGA/RJ45/RS232, Landscape, 18/7, Built-in 32GB Storage, SPK 10W*2, Android 8.0 embedded","CN"]
["CS7501","3 Year","9H.F74TC.DA2",0,3599,0,"Corporate Signage","BLACK","75\" 4K Corporate Professional Presentation Display","75\", BLACK, 3840x2160, 450nits, 1200:1, HDMI/VGA/RJ45/RS232, Landscape, 18/7, Built-in 32GB Storage, SPK 10W*2, Android 8.0 embedded","CN"]
["CS8601","3 Year","9H.F75TC.DA2",0,4999,0,"Corporate Signage","BLACK","86\" 4K Corporate Professional Presentation Display","86\", BLACK, 3840x2160, 450nits, 1200:1, HDMI/VGA/RJ45/RS232, Landscape, 18/7, Built-in 32GB Storage, SPK 16W*2, Android 8.0 embedded","CN"]
["IL4301","3 Year","9H.F7EPK.RA2",0,1499,0,"Interactive Signage","BLACK","43\" 4K  Interactive Smart Signage","43\", BLACK, 3840x2160, IPS, PID, 400 nits, 1200:1,VGA/HDMI/DP/RJ45/RS232, IR 10 points touch, Landscape/Portrait, 24/7, Built-in SPK 10W*2, Android 8.0 embedded","CN"]
["IL5501","3 Year","9H.F7FPK.RA2",0,1999,0,"Interactive Signage","BLACK","55\" 4K Interactive Smart Signage","55\", BLACK, 3840x2160, IPS, PID,400 nits, 1300:1, VGA/HDMI/DP/RJ45/RS232, IR 10 points touch, Landscape/Portrait, 24/7, Built-in SPK 10W*2, Android 8.0 embedded","CN"]
["SL8502K","3 Year","9H.F6GPK.NA2",0,5699,0,"Pantone Validated Signage","BLACK","85\" Pantone Validated Color Accurate Smart Signage","85\", BLACK, 3840x2160, PID, 500 nits, 1200:1,VGA/HDMI/USB/DP/RJ45/RS232,PANTONE Validated, Landscape/Portrait, 24/7, Built-in SPK 16W*2, Android 8.0 embedded","CN"]
["ST4302S","3 Year","9H.F7GPT.RA2",0,849,0,"Smart Signage","BLACK","43\" 4K Mainstream Smart Signage ","43\", BLACK, 3840x2160, 400 nits, 1200:1,VGA/HDMI/DVI/USB/RJ45/RS232, Landscape/Portrait, 18/7, Built-in Speaker 10Wx2, Android 8.0 embedded, Micro SD Card","CN"]
["ST7502","3 Year","9H.F6LTC.RA6",0,2999,0,"Smart Signage","BLACK","75\" 4K Mainstream Smart Signage with OPS slot","75\", BLACK, 3840x2160, 450 nits, 1200:1,VGA/HDMI/DP/USB/RJ45/RS232, Landscape, 18/7, Built-in Speaker 12Wx2, Android 8.0 embedded, OPS compatible","CN"]
["ST8602","3 Year","9H.F6NTC.RA6",0,4199,0,"Smart Signage","BLACK","86\" 4K Mainstream Smart Signage with OPS slot","86\", BLACK, 3840x2160, 450 nits, 1200:1,VGA/HDMI/DP/USB/RJ45/RS232, Landscape, 18/7, Built-in Speaker 12Wx2, Android 8.0 embedded, OPS compatible","CN"]
[]
["For a complete listing of lamps and accessories for current and discontinued projectors, please refer to monthly BenQ america Accessories Price List."]
["© Copyright 2012 BenQ America Corp.  All rights reserved.  BenQ is not responsible for any errors.  Product specifications, Part Numbers and availability subject to change without notice."]
["Lamp life results will vary depending on environmental conditions and usage."]

{"sheet":"IFC","index":3,"n_rows":10,"n_cols":18,"rows_kept":10,"cut":false,"hidden":true,"merged":[]}
["BenQ America Corp.",null,null,null,null,null,null,null,"                                                                 "]
["Effective: ",{"$f":"#REF!","v":{"$error":"#REF!"}}]
["IFC","SHORT DESCRIPTION CONTENT: Size, Resolution, Display, Key Features"]
[null,"LONG DESCRIPTION CONTENT: Size, Color, Resolution, Brightness, Germ-resistant, Anti-Glare, Contrast Ratio, Connectors, Sensor Box, Management System, Key Feature"]
["MODEL","WARRANTY","PRODUCT NUMBER","CURRENT AVI COST","OLD COST","diff","MSRP","MAP","STATUS","SERIES","COLOR","SHORT PRODUCT DESCRIPTION ","LONG PRODUCT DESCRIPTION ","UPC CODE","WEIGHT (lbs)","DIMENSION (inches)","PALLET/UNIT","COO"]
[null,{"$f":"VLOOKUP(A6,#REF!,8,FALSE)","v":{"$error":"#REF!"}},{"$f":"VLOOKUP(A6,#REF!,17,FALSE)","v":{"$error":"#REF!"}},{"$f":"VLOOKUP(A6,#REF!,38,FALSE)","v":{"$error":"#REF!"}},4499,{"$f":"D6-E6","v":{"$error":"#REF!"}},{"$f":"VLOOKUP(A6,#REF!,18,FALSE)","v":{"$error":"#REF!"}},{"$f":"VLOOKUP(A6,#REF!,19,FALSE)","v":{"$error":"#REF!"}},{"$f":"IFERROR(VLOOKUP(A6,#REF!,5,FALSE),\"\")","v":""},{"$f":"VLOOKUP(A6,#REF!,6,FALSE)","v":{"$error":"#REF!"}},{"$f":"VLOOKUP(A6,#REF!,7,FALSE)","v":{"$error":"#REF!"}},{"$f":"VLOOKUP(A6,#REF!,9,FALSE)","v":{"$error":"#REF!"}},{"$f":"VLOOKUP(A6,#REF!,10,FALSE)","v":{"$error":"#REF!"}},{"$f":"VLOOKUP(A6,#REF!,11,FALSE)","v":{"$error":"#REF!"}},{"$f":"VLOOKUP(A6,#REF!,12,FALSE)","v":{"$error":"#REF!"}},{"$f":"VLOOKUP(A6,#REF!,14,FALSE)","v":{"$error":"#REF!"}},{"$f":"VLOOKUP(A6,#REF!,60,FALSE)","v":{"$error":"#REF!"}},{"$f":"VLOOKUP(A6,#REF!,16,FALSE)","v":{"$error":"#REF!"}}]
[]
["For a complete listing of lamps and accessories for current and discontinued projectors, please refer to monthly BenQ america Accessories Price List."]
["© Copyright 2012 BenQ America Corp.  All rights reserved.  BenQ is not responsible for any errors.  Product specifications, Part Numbers and availability subject to change without notice."]
["Lamp life results will vary depending on environmental conditions and usage."]